Home > Http Error > Http Error 500 Unable To Compile Class For Jsp Spss

Http Error 500 Unable To Compile Class For Jsp Spss

There are no scriptlets in the redirect.jsp file and I tried removing everything from the /work folder. An error was received in the install log during ceuinstall_Java - the JRE-PGM is set but the JRE_CLASS is blank? share|improve this answer edited Aug 10 at 9:31 wvdz 10.6k21839 answered Dec 21 '10 at 17:10 BalusC 684k20824802695 Just updated my redirect.jsp code.. is there any change need to be done –theJava Dec 21 '10 at 17:15 Thanks for the explanation! –Rivka Nov 3 '11 at 11:08 Had the same have a peek at these guys

Recycle tm1 application service Document information More support for: Cognos TM1 TM1 Web Software version: 10.2.2 Operating system(s): Windows Software edition: All Editions Reference #: 1698848 Modified date: 2015-03-09 Site availability Historical Number PRI28787 Product Alias/Synonym Fact Connect:Enterprise UNIX, Release 2.3.00 SCI85594 RedHat 3.0 Document information More support for: Sterling Connect:Enterprise for UNIX Software version: All Operating system(s): Platform Independent Reference #: The My Documents folder * * is also mapped to a network location. Browse other questions tagged java jsp or ask your own question.

Is there any way to safely check expensive electronics on a flight? Tomcat cant create the class file but goes ahead and inappropriately assumes it was successful, and then complains latter. Can a GM prohibit players from using external reference materials (like PHB) during play? The My Documents folder is also mapped to a network location.

Which JSP?1HTTP Status 500 - Unable to compile class for JSP: in Eclipse Luna0HTTP Status 500 - Unable to compile class for JSP on Tomcat-3HTTP Status 500 - Unable to compile Note: The files are setup for the English language help. Not the answer you're looking for? Stair skirt board protruding from wall by ~1/4" - can I use a belt sander to sand it down?

Note Several things were check in determining problem - below is a list. It is indirectly referenced from required .class files 48: switch (x) 49: { 50: case 0x0008 : // backspace 51: sbuf.append("\\b"); 52: break; 53: case 0x0009 : // horizontal tab 54: However, a file called index_jsp.java should have not been in the directory. exception org.apache.jasper.JasperException: Unable to compile class for JSP: An error occurred at line: 12 in the jsp file: /login.jsp uname cannot be resolved to a variable 9: Statement st = con.createStatement();

Watson Product Search Search None of the above, continue with my search Error: HTTP ERROR: 500 Unable to compile class for JSP An error occurred at line: -1 in the JSP After reloading the page, I can see that the redirect_jsp.java file is re-created in the /work folder, but I keep getting the same errors. Dave Tolls Ranch Hand Posts: 1948 14 posted 4 months ago For starters you have code in your JSP page. Join them; it only takes a minute: Sign up HTTP Status 500 - Unable to compile class for JSP in Eclipse with the Date method up vote 0 down vote favorite

Otherwise it has to be done manually by deleting everything in work cache of the servletcontainer in question. To launch help, simply browse to that folder and double-click on help_start.bat. You should consider if that Java code doesn't better belong in a fullworthy Java class, controlled by a Servlet or a Filter. Visual IQ Puzzles with no apparent patterns?

Is the origin of the term "blackleg" racist? More about the author The problem does not occur with a local user profile. Why does the bash translation file not contain all error texts? What can I do?

Make an ASCII bat fly around an ASCII moon How to create a company culture that cares about information security? So you might try two solutions: Change ownership of tomcat work folder using chown tomcat_user -R work/ Remove work directory before starting tomcat as user with lesser permissions using rm -R Proof of 'sandwich theorem' for sequences What could make an area of land be accessible only at certain times of the year? check my blog the JRE_PGM is set but the JRE_CLASS is blank Cause Unknown - Since the link directory was used and the ceuadmind trace indicated that the daemon was looking for the JSP

You need to fix those syntax errors so that the servletcontainer can compile those JSP files. In the meantime, there are a couple of possible workarounds: 1) If you have mapped the profile using UNC paths, try -- if possible given your environment -- using a mapped Without BalusC explaining it's a compilation issue I'd have never guessed!

If you will try to start tomcat with special user that has lesser permissions it will fail to compile JSP files because of that.

But for the immediate error: uname cannot be resolved to a variable and pass cannot be resolved to a variable 'uname' and 'pass' are used in your SQL, but where are This method launches the new subsystem that Help requires outside the user profile. Save the attached .zip file to your Desktop. It is indirectly referenced from required .class files 48: switch (x) 49: { 50: case 0x0008 : // backspace 51: sbuf.append("\\b"); 52: break; 53: case 0x0009 : // horizontal tab 54:

A Two Faced Coin Where are sudo's insults stored? more hot questions question feed lang-java about us tour help blog chat data legal privacy policy work here advertising info mobile contact us feedback Technology Life / Arts Culture / Recreation Changing the presentation of a matrix plot re-re-reCAPTCHA The use of each key in Western music Why is a lottery conducted for sick patients to be cured? http://upintheaether.com/http-error/http-error-unsupported-http-response-status-400-bad-request.php exception org.apache.jasper.JasperException: Unable to compile class for JSP: An error occurred at line: 13 in the jsp file: /index.jsp Syntax error on token "import", delete this token 10: 11: 12: 13:

use of diodes and resistors in a push-pull amplifier Should a spacecraft be launched towards the East? Error description When using IBM SPSS Statistics 19 you can get the following error when trying to access online Help-Topics, Tutorial, Case Studies or Statistics Coach when the user profile is The main Help system contains access to the Tutorial and other materials toward the bottom of the Contents list. Watson Product Search Search None of the above, continue with my search Getting HTTP Error: 500 unable to compile class for jsp when trying to access online Help topics, tutorial, case

Proof of 'sandwich theorem' for sequences Ethical dilemma: I work at a consultancy. If you would like to create the batch files for other languages use this switch in your single batch files: de_DE (German) es_ES (Spanish) fr_FR (French) it_IT (Italian) ja_JP (Japanese) ko_KR The exception java.lang.ClassNotFoundException: org.apache.jsp.redirect_jsp means that the redirect.jsp file in the root of your webcontent folder failed to compile which in turn often means that it contains some raw Java code Changing the presentation of a matrix plot where is difficulty target inserted?

more stack exchange communities company blog Stack Exchange Inbox Reputation and Badges sign up log in tour help Tour Start here for a quick overview of the site Help Center Detailed